Target
Potassium voltage-gated channel subfamily H member 2
Ligand
BDBM50240701
Substrate
Meas. Tech.
ChEMBL_540080 (CHEMBL1036648)
IC50
14125.38±n/a nM
Citation
 Coi, AMassarelli, ITestai, LCalderone, VBianucci, AM Identification of"toxicophoric" features for predicting drug-induced QT interval prolongation. Eur J Med Chem 43:2479-88 (2008)  
Target
Name:
Potassium voltage-gated channel subfamily H member 2
Synonyms:
1,3-beta-glucan synthase component GLS2 ERG Eag-related protein 1 Ether-a-go-go-related gene (HERG) Ether-a-go-go-related gene potassium channel 1 Ether-a-go-go-related gene potassium channel 1 (hERG1) Ether-a-go-go-related protein 1 H-ERG KCNH2 Potassium voltage-gated channel subfamily H member 2 (hERG) Voltage-gated potassium channel subunit Kv11.1 hERG Potassium Channel 1 | putative potassium channel subunit
Type:
Multi-pass membrane protein
Mol. Mass.:
126672.65
Organism:
Homo sapiens (Human)
Description:
Q12809
Residue:
1159
  
Inhibitor
Name:
BDBM50240701
Synonyms:
2-Methyl-10-piperazin-1-yl-4H-3-thia-4,9-diaza-benzo[f]azulene CHEMBL1125 olanzapine, N-desmethyl
Type:
Small organic molecule
Emp. Form.:
C16H18N4S
Mol. Mass.:
298.406
SMILES:
Cc1cc2c(Nc3ccccc3N=C2N2CCNCC2)s1
: