Target
5-hydroxytryptamine receptor 1A
Ligand
BDBM50026917
Substrate
Meas. Tech.
ChEMBL_615926 (CHEMBL1099772)
Ki
1.26±n/a nM
Citation
 Franchini, SPrandi, ASorbi, CTait, ABaraldi, AAngeli, PBuccioni, MCilia, APoggesi, EFossa, PBrasili, L Discovery of a new series of 5-HT1A receptor agonists. Bioorg Med Chem Lett 20:2017-20 (2010)  
Target
Name:
5-hydroxytryptamine receptor 1A
Synonyms:
5-HT-1A 5-hydroxytryptamine receptor 1A (5-HT-1A) ADRB2RL1 Dopamine D2 receptor and serotonin 1a receptor HTR1A | Serotonin receptor 1A
Type:
Mol. Mass.:
46122.49
Organism:
Homo sapiens (Human)
Description:
Residue:
422
  
Inhibitor
Name:
BDBM50026917
Synonyms:
8-(2-(4-(2-methoxyphenyl)piperazin-1-yl)ethyl)-8-azaspiro[4.5]decane-7,9-dione 8-{2-[4-(2-Methoxy-phenyl)-piperazin-1-yl]-ethyl}-8-aza-spiro[4.5]decane-7,9-dione BMY 7378 CHEMBL1256934 CHEMBL543741
Type:
Small organic molecule
Emp. Form.:
C22H31N3O3
Mol. Mass.:
385.4998
SMILES:
COc1ccccc1N1CCN(CCN2C(=O)CC3(CCCC3)CC2=O)CC1
: