Target
Alpha-1B adrenergic receptor
Ligand
BDBM50415776
Substrate
Meas. Tech.
ChEMBL_615773 (CHEMBL1100127)
Ki
100±n/a nM
Citation
 Franchini, SPrandi, ASorbi, CTait, ABaraldi, AAngeli, PBuccioni, MCilia, APoggesi, EFossa, PBrasili, L Discovery of a new series of 5-HT1A receptor agonists. Bioorg Med Chem Lett 20:2017-20 (2010)  
Target
Name:
Alpha-1B adrenergic receptor
Synonyms:
ADA1B_HUMAN Adrenergic alpha1B Adrenergic receptor alpha Alpha 1B-adrenoreceptor | Alpha-1B adrenergic receptor
Type:
Enzyme
Mol. Mass.:
56862.13
Organism:
Homo sapiens (Human)
Description:
P35368
Residue:
520
  
Inhibitor
Name:
BDBM50415776
Synonyms:
CHEMBL1083182
Type:
Small organic molecule
Emp. Form.:
C25H27NO3S
Mol. Mass.:
421.552
SMILES:
COc1ccccc1OCCNCC1CSC(O1)(c1ccccc1)c1ccccc1
: