Target
Alpha-1A adrenergic receptor
Ligand
BDBM50409813
Substrate
Meas. Tech.
ChEMBL_615772 (CHEMBL1100126)
Ki
37.15±n/a nM
Citation
 Franchini, SPrandi, ASorbi, CTait, ABaraldi, AAngeli, PBuccioni, MCilia, APoggesi, EFossa, PBrasili, L Discovery of a new series of 5-HT1A receptor agonists. Bioorg Med Chem Lett 20:2017-20 (2010)  
Target
Name:
Alpha-1A adrenergic receptor
Synonyms:
ADA1A_HUMAN ADRA1C Alpha 1A-adrenoceptor Alpha adrenergic receptor 1a Alpha-adrenergic receptor 1c adrenergic Alpha1 | adrenergic Alpha1C
Type:
Cell-surface receptors
Mol. Mass.:
51511.67
Organism:
Homo sapiens (Human)
Description:
P35348
Residue:
466
  
Inhibitor
Name:
BDBM50409813
Synonyms:
CHEMBL1083181 | CHEMBL37883
Type:
Small organic molecule
Emp. Form.:
C24H25NO3
Mol. Mass.:
375.4602
SMILES:
C(COc1ccccc1)NCC1COC(O1)(c1ccccc1)c1ccccc1
: