Target
Beta-2 adrenergic receptor
Ligand
BDBM50416065
Substrate
Meas. Tech.
ChEMBL_634432 (CHEMBL1119458)
EC50
7.9±n/a nM
Citation
 Procopiou, PABarrett, VJBevan, NJBiggadike, KBox, PCButchers, PRCoe, DMConroy, REmmons, AFord, AJHolmes, DSHorsley, HKerr, FLi-Kwai-Cheung, AMLooker, BEMann, ISMcLay, IMMorrison, VSMutch, PJSmith, CETomlin, P Synthesis and structure-activity relationships of long-acting beta2 adrenergic receptor agonists incorporating metabolic inactivation: an antedrug approach. J Med Chem 53:4522-30 (2010)  
Target
Name:
Beta-2 adrenergic receptor
Synonyms:
ADRB2 ADRB2_HUMAN Beta-2 adrenoceptor | Beta-2 adrenoreceptor
Type:
Mol. Mass.:
46461.69
Organism:
Homo sapiens (Human)
Description:
P07550
Residue:
413
  
Inhibitor
Name:
BDBM50416065
Synonyms:
CHEMBL1086535
Type:
Small organic molecule
Emp. Form.:
C24H35NO6
Mol. Mass.:
433.5378
SMILES:
OCc1cc(ccc1O)[C@@H](O)CNCCCCCCOCCOCc1ccc(O)cc1
: