Target
Beta-3 adrenergic receptor
Ligand
BDBM50416065
Substrate
Meas. Tech.
ChEMBL_634435 (CHEMBL1119461)
EC50
63±n/a nM
Citation
 Procopiou, PABarrett, VJBevan, NJBiggadike, KBox, PCButchers, PRCoe, DMConroy, REmmons, AFord, AJHolmes, DSHorsley, HKerr, FLi-Kwai-Cheung, AMLooker, BEMann, ISMcLay, IMMorrison, VSMutch, PJSmith, CETomlin, P Synthesis and structure-activity relationships of long-acting beta2 adrenergic receptor agonists incorporating metabolic inactivation: an antedrug approach. J Med Chem 53:4522-30 (2010)  
Target
Name:
Beta-3 adrenergic receptor
Synonyms:
ADRB3 ADRB3_HUMAN Beta-2 adrenergic receptor and beta-3 adrenergic receptor Beta-3 adrenoreceptor | adrenergic Beta3
Type:
G Protein-Coupled Receptor (GPCR)
Mol. Mass.:
43534.88
Organism:
Homo sapiens (Human)
Description:
Residue:
408
  
Inhibitor
Name:
BDBM50416065
Synonyms:
CHEMBL1086535
Type:
Small organic molecule
Emp. Form.:
C24H35NO6
Mol. Mass.:
433.5378
SMILES:
OCc1cc(ccc1O)[C@@H](O)CNCCCCCCOCCOCc1ccc(O)cc1
: