Target
Beta-1 adrenergic receptor
Ligand
BDBM50416060
Substrate
Meas. Tech.
ChEMBL_634434 (CHEMBL1119460)
EC50
398±n/a nM
Citation
 Procopiou, PABarrett, VJBevan, NJBiggadike, KBox, PCButchers, PRCoe, DMConroy, REmmons, AFord, AJHolmes, DSHorsley, HKerr, FLi-Kwai-Cheung, AMLooker, BEMann, ISMcLay, IMMorrison, VSMutch, PJSmith, CETomlin, P Synthesis and structure-activity relationships of long-acting beta2 adrenergic receptor agonists incorporating metabolic inactivation: an antedrug approach. J Med Chem 53:4522-30 (2010)  
Target
Name:
Beta-1 adrenergic receptor
Synonyms:
ADRB1 ADRB1_HUMAN Beta-1 adrenoceptor adrenergic Beta1
Type:
G Protein-Coupled Receptor (GPCR)
Mol. Mass.:
51338.40
Organism:
Homo sapiens (Human)
Description:
P08588
Residue:
477
  
Inhibitor
Name:
BDBM50416060
Synonyms:
4-(2-((6-((2-(((2,6-dichlorophenyl)methyl)oxy)ethyl)oxy)hexyl)amino)-1-hydroxyethyl)-2-(hydroxymethyl)phenol VILANTEROL
Type:
Small organic molecule
Emp. Form.:
C24H33Cl2NO5
Mol. Mass.:
486.429
SMILES:
OCc1cc(ccc1O)[C@@H](O)CNCCCCCCOCCOCc1c(Cl)cccc1Cl
: