Target
Beta-1 adrenergic receptor
Ligand
BDBM25771
Substrate
Meas. Tech.
ChEMBL_634434 (CHEMBL1119460)
EC50
794±n/a nM
Citation
 Procopiou, PABarrett, VJBevan, NJBiggadike, KBox, PCButchers, PRCoe, DMConroy, REmmons, AFord, AJHolmes, DSHorsley, HKerr, FLi-Kwai-Cheung, AMLooker, BEMann, ISMcLay, IMMorrison, VSMutch, PJSmith, CETomlin, P Synthesis and structure-activity relationships of long-acting beta2 adrenergic receptor agonists incorporating metabolic inactivation: an antedrug approach. J Med Chem 53:4522-30 (2010)  
Target
Name:
Beta-1 adrenergic receptor
Synonyms:
ADRB1 ADRB1_HUMAN Beta-1 adrenoceptor adrenergic Beta1
Type:
G Protein-Coupled Receptor (GPCR)
Mol. Mass.:
51338.40
Organism:
Homo sapiens (Human)
Description:
P08588
Residue:
477
  
Inhibitor
Name:
BDBM25771
Synonyms:
1-hydroxy-2-naphthoic acid;4-[1-hydroxy-2-[6-(4-phenylbutoxy)hexylamino]ethyl]-2-methylol-phenol Aeromax Serevent | salmeterol xinafoate
Type:
Small organic molecule
Emp. Form.:
C25H37NO4
Mol. Mass.:
415.5656
SMILES:
OCc1cc(ccc1O)C(O)CNCCCCCCOCCCCc1ccccc1
: