Target
Prostaglandin D2 receptor
Ligand
BDBM50417722
Substrate
Meas. Tech.
ChEMBL_701282 (CHEMBL1648902)
IC50
0.02±n/a nM
Citation
 Mu, LAguiar, JArdati, ACao, BGardner, CJGillespy, THarris, KLim, SMarcus, RMorize, IParkar, AStefany, DLi, YVaz, RJCirovic, DA Understanding DP receptor antagonism using a CoMSIA approach. Bioorg Med Chem Lett 21:66-75 (2010)  
Target
Name:
Prostaglandin D2 receptor
Synonyms:
PD2R_HUMAN Prostaglandin D2 Prostanoid DP receptor
Type:
Enzyme
Mol. Mass.:
40288.87
Organism:
Homo sapiens (Human)
Description:
Q13258
Residue:
359
  
Inhibitor
Name:
BDBM50417722
Synonyms:
CHEMBL1644207
Type:
Small organic molecule
Emp. Form.:
C21H17Cl2F2N3O3
Mol. Mass.:
468.281
SMILES:
COc1nc(NCCc2ccc(Cl)cc2Cl)cc(n1)-c1cccc(c1)C(F)(F)C(O)=O
: