Target
Prostaglandin D2 receptor
Ligand
BDBM50417734
Substrate
Meas. Tech.
ChEMBL_701282 (CHEMBL1648902)
IC50
7.59±n/a nM
Citation
 Mu, LAguiar, JArdati, ACao, BGardner, CJGillespy, THarris, KLim, SMarcus, RMorize, IParkar, AStefany, DLi, YVaz, RJCirovic, DA Understanding DP receptor antagonism using a CoMSIA approach. Bioorg Med Chem Lett 21:66-75 (2010)  
Target
Name:
Prostaglandin D2 receptor
Synonyms:
PD2R_HUMAN Prostaglandin D2 Prostanoid DP receptor
Type:
Enzyme
Mol. Mass.:
40288.87
Organism:
Homo sapiens (Human)
Description:
Q13258
Residue:
359
  
Inhibitor
Name:
BDBM50417734
Synonyms:
CHEMBL1644226
Type:
Small organic molecule
Emp. Form.:
C23H27N5O3
Mol. Mass.:
421.4922
SMILES:
CCNC(=O)Nc1cccc(c1)-c1cc(NCCc2ccc(OC)cc2)nc(OC)n1
: