Target
Prostaglandin D2 receptor
Ligand
BDBM50417742
Substrate
Meas. Tech.
ChEMBL_701282 (CHEMBL1648902)
IC50
16.98±n/a nM
Citation
 Mu, LAguiar, JArdati, ACao, BGardner, CJGillespy, THarris, KLim, SMarcus, RMorize, IParkar, AStefany, DLi, YVaz, RJCirovic, DA Understanding DP receptor antagonism using a CoMSIA approach. Bioorg Med Chem Lett 21:66-75 (2010)  
Target
Name:
Prostaglandin D2 receptor
Synonyms:
PD2R_HUMAN Prostaglandin D2 Prostanoid DP receptor
Type:
Enzyme
Mol. Mass.:
40288.87
Organism:
Homo sapiens (Human)
Description:
Q13258
Residue:
359
  
Inhibitor
Name:
BDBM50417742
Synonyms:
CHEMBL1644237
Type:
Small organic molecule
Emp. Form.:
C20H21N3O3
Mol. Mass.:
351.399
SMILES:
COc1ccc(CCNc2cc(nc(OC)n2)-c2ccccc2O)cc1
: