Target
Prostaglandin D2 receptor
Ligand
BDBM50417748
Substrate
Meas. Tech.
ChEMBL_701282 (CHEMBL1648902)
IC50
14.13±n/a nM
Citation
 Mu, LAguiar, JArdati, ACao, BGardner, CJGillespy, THarris, KLim, SMarcus, RMorize, IParkar, AStefany, DLi, YVaz, RJCirovic, DA Understanding DP receptor antagonism using a CoMSIA approach. Bioorg Med Chem Lett 21:66-75 (2010)  
Target
Name:
Prostaglandin D2 receptor
Synonyms:
PD2R_HUMAN Prostaglandin D2 Prostanoid DP receptor
Type:
Enzyme
Mol. Mass.:
40288.87
Organism:
Homo sapiens (Human)
Description:
Q13258
Residue:
359
  
Inhibitor
Name:
BDBM50417748
Synonyms:
CHEMBL1644246
Type:
Small organic molecule
Emp. Form.:
C21H20ClFN4O4
Mol. Mass.:
446.859
SMILES:
COC(=O)Cn1cc(ccc1=O)-c1cc(NCCc2c(F)cccc2Cl)nc(OC)n1
: