Target
Peroxisome proliferator-activated receptor gamma
Ligand
BDBM50418561
Substrate
Meas. Tech.
ChEMBL_749292 (CHEMBL1785227)
Ki
169000000±n/a nM
Citation
 Dixit, ASaxena, AK QSAR analysis of PPAR-gamma agonists as anti-diabetic agents. Eur J Med Chem 43:73-80 (2008)  
Target
Name:
Peroxisome proliferator-activated receptor gamma
Synonyms:
NR1C3 PPAR-gamma PPARG_HUMAN Peroxisome proliferator-activated receptor gamma (PPAR gamma) Peroxisome proliferator-activated receptor gamma (PPARĪ³) peroxisome proliferator-activated receptor gamma isoform 2
Type:
Nuclear Receptor
Mol. Mass.:
57613.46
Organism:
Homo sapiens (Human)
Description:
P37231
Residue:
505
  
Inhibitor
Name:
BDBM50418561
Synonyms:
CHEMBL147042
Type:
Small organic molecule
Emp. Form.:
C29H25NO4
Mol. Mass.:
451.5131
SMILES:
OC(=O)[C@H](Cc1ccc(OCc2ccccc2)cc1)Nc1ccc(cc1)C(=O)c1ccccc1
: