Target
Peroxisome proliferator-activated receptor gamma
Ligand
BDBM50418563
Substrate
Meas. Tech.
ChEMBL_749292 (CHEMBL1785227)
Ki
120000000±n/a nM
Citation
 Dixit, ASaxena, AK QSAR analysis of PPAR-gamma agonists as anti-diabetic agents. Eur J Med Chem 43:73-80 (2008)  
Target
Name:
Peroxisome proliferator-activated receptor gamma
Synonyms:
NR1C3 PPAR-gamma PPARG_HUMAN Peroxisome proliferator-activated receptor gamma (PPAR gamma) Peroxisome proliferator-activated receptor gamma (PPARĪ³) peroxisome proliferator-activated receptor gamma isoform 2
Type:
Nuclear Receptor
Mol. Mass.:
57613.46
Organism:
Homo sapiens (Human)
Description:
P37231
Residue:
505
  
Inhibitor
Name:
BDBM50418563
Synonyms:
CHEMBL148301
Type:
Small organic molecule
Emp. Form.:
C36H37NO6
Mol. Mass.:
579.6821
SMILES:
Cc1c(C)c2OC(C)(COc3ccc(C[C@H](Nc4ccccc4C(=O)c4ccccc4)C(O)=O)cc3)CCc2c(C)c1O
: