Target
Peroxisome proliferator-activated receptor gamma
Ligand
BDBM50418565
Substrate
Meas. Tech.
ChEMBL_749292 (CHEMBL1785227)
Ki
132000000±n/a nM
Citation
 Dixit, ASaxena, AK QSAR analysis of PPAR-gamma agonists as anti-diabetic agents. Eur J Med Chem 43:73-80 (2008)  
Target
Name:
Peroxisome proliferator-activated receptor gamma
Synonyms:
NR1C3 PPAR-gamma PPARG_HUMAN Peroxisome proliferator-activated receptor gamma (PPAR gamma) Peroxisome proliferator-activated receptor gamma (PPARĪ³) peroxisome proliferator-activated receptor gamma isoform 2
Type:
Nuclear Receptor
Mol. Mass.:
57613.46
Organism:
Homo sapiens (Human)
Description:
P37231
Residue:
505
  
Inhibitor
Name:
BDBM50418565
Synonyms:
CHEMBL1785075
Type:
Small organic molecule
Emp. Form.:
C33H30N2O5
Mol. Mass.:
534.6017
SMILES:
CN(CCOc1ccc(CC(Cc2ccccc2C(=O)c2ccccc2)C(O)=O)cc1)c1nc2ccccc2o1
: