Target
Alpha-1D adrenergic receptor
Ligand
BDBM50143697
Substrate
Meas. Tech.
ChEMBL_753883 (CHEMBL1798145)
Ki
0.129±n/a nM
Citation
 Romeo, GMateria, LModica, MNPittalà, VSalerno, LSiracusa, MAManetti, FBotta, MMinneman, KP Novel 4-phenylpiperidine-2,6-dione derivatives. Ligands fora1-adrenoceptor subtypes. Eur J Med Chem 46:2676-90 (2011)  
Target
Name:
Alpha-1D adrenergic receptor
Synonyms:
ADA1D_HUMAN ADRA1D Adrenergic receptor alpha Alpha 1D-adrenoreceptor Alpha-1D adrenoceptor adrenergic Alpha1D
Type:
Enzyme Catalytic Domain
Mol. Mass.:
60485.82
Organism:
Homo sapiens (Human)
Description:
adrenergic Alpha1D ADRA1D HUMAN::P25100
Residue:
572
  
Inhibitor
Name:
BDBM50143697
Synonyms:
8-{2-[4-(2,5-Dichloro-phenyl)-piperazin-1-yl]-ethyl}-8-aza-spiro[4.5]decane-7,9-dione | CHEMBL56438
Type:
Small organic molecule
Emp. Form.:
C21H27Cl2N3O2
Mol. Mass.:
424.364
SMILES:
Clc1ccc(Cl)c(c1)N1CCN(CCN2C(=O)CC3(CCCC3)CC2=O)CC1
: