Target
Beta-2 adrenergic receptor
Ligand
BDBM50422409
Substrate
Meas. Tech.
ChEMBL_41548 (CHEMBL858099)
EC50
<1000±n/a nM
Citation
 Uehling, DEDonaldson, KHDeaton, DNHyman, CESugg, EEBarrett, DGHughes, RGReitter, BAdkison, KKLancaster, MELee, FHart, RPaulik, MASherman, BWTrue, TCowan, C Synthesis and evaluation of potent and selective beta(3) adrenergic receptor agonists containing acylsulfonamide, sulfonylsulfonamide, and sulfonylurea carboxylic acid isosteres. J Med Chem 45:567-83 (2002)  
Target
Name:
Beta-2 adrenergic receptor
Synonyms:
ADRB2 ADRB2_HUMAN Beta-2 adrenoceptor | Beta-2 adrenoreceptor
Type:
Mol. Mass.:
46461.69
Organism:
Homo sapiens (Human)
Description:
P07550
Residue:
413
  
Inhibitor
Name:
BDBM50422409
Synonyms:
CHEMBL347582
Type:
Small organic molecule
Emp. Form.:
C26H30ClN3O4S
Mol. Mass.:
516.052
SMILES:
C[C@H](CNc1cccc(CC(=O)NS(=O)(=O)c2ccc(C)cc2)c1)NC[C@H](O)c1cccc(Cl)c1
: