Target
Peroxisome proliferator-activated receptor gamma
Ligand
BDBM50423007
Substrate
Meas. Tech.
ChEMBL_438960 (CHEMBL889304)
Ki
912±n/a nM
Citation
 Trump, RPCobb, JEShearer, BGLambert, MHNolte, RTWillson, TMBuckholz, RGZhao, SMLeesnitzer, LMIannone, MAPearce, KHBillin, ANHoekstra, WJ Co-crystal structure guided array synthesis of PPARgamma inverse agonists. Bioorg Med Chem Lett 17:3916-20 (2007)  
Target
Name:
Peroxisome proliferator-activated receptor gamma
Synonyms:
NR1C3 PPAR-gamma PPARG_HUMAN Peroxisome proliferator-activated receptor gamma (PPAR gamma) Peroxisome proliferator-activated receptor gamma (PPARĪ³) peroxisome proliferator-activated receptor gamma isoform 2
Type:
Nuclear Receptor
Mol. Mass.:
57613.46
Organism:
Homo sapiens (Human)
Description:
P37231
Residue:
505
  
Inhibitor
Name:
BDBM50423007
Synonyms:
CHEMBL398185
Type:
Small organic molecule
Emp. Form.:
C39H39N3O6
Mol. Mass.:
645.7435
SMILES:
CC(CC(=O)NC[C@H](Cc1ccc(OCCc2nc(oc2C)-c2ccccc2)cc1)Nc1ccccc1C(=O)c1ccccc1)C(O)=O
: