Target
Egl nine homolog 1
Ligand
BDBM50396018
Substrate
Meas. Tech.
ChEMBL_934089 (CHEMBL2318591)
IC50
15000±n/a nM
Citation
 Leung, IKDemetriades, MHardy, APLejeune, CSmart, TJSzöllössi, AKawamura, ASchofield, CJClaridge, TD Reporter ligand NMR screening method for 2-oxoglutarate oxygenase inhibitors. J Med Chem 56:547-55 (2013)  
Target
Name:
Egl nine homolog 1
Synonyms:
C1orf12 EGLN1_HUMAN Hypoxia-inducible factor prolyl hydroxylase 2 (HIF-PH2) Prolyl hydroxylase domain-containing protein 2 (PHD2)
Type:
Protein
Mol. Mass.:
46035.59
Organism:
Homo sapiens (Human)
Description:
Q9GZT9
Residue:
426
  
Inhibitor
Name:
BDBM50396018
Synonyms:
CHEMBL1230640
Type:
Small organic molecule
Emp. Form.:
C10H7NO3
Mol. Mass.:
189.1675
SMILES:
OC(=O)c1ccc(O)c2ncccc12
: