Target
Vasopressin V2 receptor
Ligand
BDBM50127138
Substrate
Meas. Tech.
ChEMBL_941873 (CHEMBL2329906)
IC50
6000±n/a nM
Citation
 Sassano, MFDoak, AKRoth, BLShoichet, BK Colloidal aggregation causes inhibition of G protein-coupled receptors. J Med Chem 56:2406-14 (2013)  
Target
Name:
Vasopressin V2 receptor
Synonyms:
ADHR AVPR2 DIR Renal-type arginine vasopressin receptor V2R_HUMAN Vasopressin V2 receptor | Vasopressin receptor
Type:
Receptor
Mol. Mass.:
40295.28
Organism:
Homo sapiens (Human)
Description:
P30518
Residue:
371
  
Inhibitor
Name:
BDBM50127138
Synonyms:
2-(butan-2-yl)-4-{4-[4-(4-{[(2R,4S)-2-(2,4-dichlorophenyl)-2-(1H-1,2,4-triazol-1-ylmethyl)-1,3-dioxolan-4-yl]methoxy}phenyl)piperazin-1-yl]phenyl}-2,4-dihydro-3H-1,2,4-triazol-3-one ITRACONAZOLE Oriconazole | Sporanox (TN)
Type:
Small organic molecule
Emp. Form.:
C35H38Cl2N8O4
Mol. Mass.:
705.633
SMILES:
CCC(C)n1ncn(-c2ccc(cc2)N2CCN(CC2)c2ccc(OC[C@H]3CO[C@@](Cn4cncn4)(O3)c3ccc(Cl)cc3Cl)cc2)c1=O
: