Target
Arginase-2, mitochondrial
Ligand
BDBM50427906
Substrate
Meas. Tech.
ChEMBL_940978 (CHEMBL2330668)
IC50
390±n/a nM
Citation
 Van Zandt, MCWhitehouse, DLGolebiowski, AJi, MKZhang, MBeckett, RPJagdmann, GERyder, TRSheeler, RAndreoli, MConway, BMahboubi, KD'Angelo, GMitschler, ACousido-Siah, ARuiz, FXHoward, EIPodjarny, ADSchroeter, H Discovery of (R)-2-amino-6-borono-2-(2-(piperidin-1-yl)ethyl)hexanoic acid and congeners as highly potent inhibitors of human arginases I and II for treatment of myocardial reperfusion injury. J Med Chem 56:2568-80 (2013)  
Target
Name:
Arginase-2, mitochondrial
Synonyms:
ARG2 Arginase II Non-hepatic arginase | Type II arginase
Type:
PROTEIN
Mol. Mass.:
38576.93
Organism:
Homo sapiens (Human)
Description:
ChEMBL_978892
Residue:
354
  
Inhibitor
Name:
BDBM50427906
Synonyms:
CHEMBL2326084
Type:
Small organic molecule
Emp. Form.:
C12H27BN2O5
Mol. Mass.:
290.164
SMILES:
CCN(CCO)CC[C@](N)(CCCCB(O)O)C(O)=O
: