Target
5-hydroxytryptamine receptor 2B
Ligand
BDBM50428538
Substrate
Meas. Tech.
ChEMBL_944534 (CHEMBL2339050)
Ki
73±n/a nM
Citation
 Fevig, JMFeng, JRossi, KAMiller, KJWu, GHung, CPUng, TMalmstrom, SEZhang, GKeim, WJCullen, MJRohrbach, KWQu, QGan, JPelleymounter, MARobl, JA Synthesis and SAR of 2,3,3a,4-tetrahydro-1H-pyrrolo[3,4-c]isoquinolin-5(9bH)-ones as 5-HT2C receptor agonists. Bioorg Med Chem Lett 23:330-5 (2012)  
Target
Name:
5-hydroxytryptamine receptor 2B
Synonyms:
5-HT-2B 5-hydroxytryptamine (serotonin) receptor 2B [Homo sapiens] 5-hydroxytryptamine receptor 2C (5HT2C) HTR2B Serotonin 2b (5-HT2b) receptor | Serotonin Receptor 2B
Type:
G Protein-Coupled Receptor (GPCR)
Mol. Mass.:
54312.47
Organism:
Homo sapiens (Human)
Description:
Receptor binding assays were performed using human clone stably expressed in CHO cells.
Residue:
481
  
Inhibitor
Name:
BDBM50428538
Synonyms:
CHEMBL2337490
Type:
Small organic molecule
Emp. Form.:
C12H11F3N2O
Mol. Mass.:
256.2237
SMILES:
FC(F)(F)c1cccc2[C@H]3CNC[C@@H]3NC(=O)c12
: