Target
Metabotropic glutamate receptor 5
Ligand
BDBM50429414
Substrate
Meas. Tech.
ChEMBL_942306 (CHEMBL2343304)
IC50
59±n/a nM
Citation
 Zhou, HTopiol, SWGrenon, MJimenez, HNUberti, MASmith, DGBrodbeck, RMChandrasena, GPedersen, HMadsen, JCDoller, DLi, G Discovery and structure-activity relationship of 1,3-cyclohexyl amide derivatives as novel mGluR5 negative allosteric modulators. Bioorg Med Chem Lett 23:1398-406 (2013)  
Target
Name:
Metabotropic glutamate receptor 5
Synonyms:
GPRC1E GRM5_HUMAN metabotropic glutamate 5 | metabotropic glutamate 5a
Type:
Enzyme
Mol. Mass.:
132484.72
Organism:
Homo sapiens (Human)
Description:
Residue:
1212
  
Inhibitor
Name:
BDBM50429414
Synonyms:
CHEMBL2338567
Type:
Small organic molecule
Emp. Form.:
C20H20ClFN2O2
Mol. Mass.:
374.836
SMILES:
Fc1cccc(c1)C(=O)N[C@@H]1CCC[C@H](C1)NC(=O)c1cccc(Cl)c1
: