Target
Sodium-dependent serotonin transporter
Ligand
BDBM35229
Substrate
Meas. Tech.
ChEMBL_942365 (CHEMBL2344277)
IC50
560±n/a nM
Citation
 Bright, SABrinkø, ALarsen, MTSinning, SWilliams, DCJensen, HH Basic N-interlinked imipramines show apoptotic activity against malignant cells including Burkitt's lymphoma. Bioorg Med Chem Lett 23:1220-4 (2013)  
Target
Name:
Sodium-dependent serotonin transporter
Synonyms:
5-HT Transporter 5HTT SC6A4_HUMAN SLC6A4 Serotonin transporter (5HTT) Sodium-dependent serotonin transporter (SERT) | Solute carrier family 6 member 4
Type:
Multi-pass membrane protein
Mol. Mass.:
70322.51
Organism:
Homo sapiens (Human)
Description:
P31645
Residue:
630
  
Inhibitor
Name:
BDBM35229
Synonyms:
3-(10,11-dihydro-5H-dibenzo[b,f]azepin-5-yl)-N-methylpropan-1-amine CHEMBL72 DMI Desipramine N-(3-methylaminopropyl)iminobibenzyl demethylimipramine norimipramine
Type:
Small organic molecule
Emp. Form.:
C18H22N2
Mol. Mass.:
266.3807
SMILES:
CNCCCN1c2ccccc2CCc2ccccc12
: