Target
Lysophosphatidic acid receptor 2
Ligand
BDBM50430006
Substrate
Meas. Tech.
ChEMBL_946260 (CHEMBL2344998)
EC50
100±n/a nM
Citation
 Jiang, GInoue, AAoki, JPrestwich, GD Phosphorothioate analogs of sn-2 radyl lysophosphatidic acid (LPA): metabolically stabilized LPA receptor agonists. Bioorg Med Chem Lett 23:1865-9 (2013)  
Target
Name:
Lysophosphatidic acid receptor 2
Synonyms:
EDG4 LPA-2 LPAR2 Lysophosphatidic acid receptor 2 | Lysophosphatidic acid receptor Edg-4
Type:
PROTEIN
Mol. Mass.:
39103.44
Organism:
Homo sapiens (Human)
Description:
ChEMBL_1451385
Residue:
351
  
Inhibitor
Name:
BDBM50430006
Synonyms:
CHEMBL2335048
Type:
Small organic molecule
Emp. Form.:
C22H47O5PS
Mol. Mass.:
454.644
SMILES:
[C@H](COP(O)(O)=S)OC
: