Target
Lysophosphatidic acid receptor 2
Ligand
BDBM50430008
Substrate
Meas. Tech.
ChEMBL_946260 (CHEMBL2344998)
EC50
117±n/a nM
Citation
 Jiang, GInoue, AAoki, JPrestwich, GD Phosphorothioate analogs of sn-2 radyl lysophosphatidic acid (LPA): metabolically stabilized LPA receptor agonists. Bioorg Med Chem Lett 23:1865-9 (2013)  
Target
Name:
Lysophosphatidic acid receptor 2
Synonyms:
EDG4 LPA-2 LPAR2 Lysophosphatidic acid receptor 2 | Lysophosphatidic acid receptor Edg-4
Type:
PROTEIN
Mol. Mass.:
39103.44
Organism:
Homo sapiens (Human)
Description:
ChEMBL_1451385
Residue:
351
  
Inhibitor
Name:
BDBM50430008
Synonyms:
CHEMBL2335050
Type:
Small organic molecule
Emp. Form.:
C21H44O5PS
Mol. Mass.:
439.61
SMILES:
CCCCCCCCCCCCCCCCCOC(COC)COP(O)([O-])=S
: