Target
Estrogen receptor beta
Ligand
BDBM50431192
Substrate
Meas. Tech.
ChEMBL_948804 (CHEMBL2339766)
EC50
1230±n/a nM
Citation
 Min, JWang, PSrinivasan, SNwachukwu, JCGuo, PHuang, MCarlson, KEKatzenellenbogen, JANettles, KWZhou, HB Thiophene-core estrogen receptor ligands having superagonist activity. J Med Chem 56:3346-66 (2013)  
Target
Name:
Estrogen receptor beta
Synonyms:
ER-beta ESR2_HUMAN Estradiol receptor beta (ERβ) Estrogen receptor (ER beta) Estrogen receptor beta (ER beta) NR3A2 estrogen beta
Type:
Protein
Mol. Mass.:
59238.43
Organism:
Homo sapiens (Human)
Description:
Q92731
Residue:
530
  
Inhibitor
Name:
BDBM50431192
Synonyms:
CHEMBL2332574
Type:
Small organic molecule
Emp. Form.:
C17H14O2S
Mol. Mass.:
282.357
SMILES:
Cc1cc(sc1-c1ccc(O)cc1)-c1ccc(O)cc1
: