Target
Estrogen receptor beta
Ligand
BDBM50431195
Substrate
Meas. Tech.
ChEMBL_948804 (CHEMBL2339766)
EC50
1340±n/a nM
Citation
 Min, JWang, PSrinivasan, SNwachukwu, JCGuo, PHuang, MCarlson, KEKatzenellenbogen, JANettles, KWZhou, HB Thiophene-core estrogen receptor ligands having superagonist activity. J Med Chem 56:3346-66 (2013)  
Target
Name:
Estrogen receptor beta
Synonyms:
ER-beta ESR2_HUMAN Estradiol receptor beta (ERβ) Estrogen receptor (ER beta) Estrogen receptor beta (ER beta) NR3A2 estrogen beta
Type:
Protein
Mol. Mass.:
59238.43
Organism:
Homo sapiens (Human)
Description:
Q92731
Residue:
530
  
Inhibitor
Name:
BDBM50431195
Synonyms:
CHEMBL2332570
Type:
Small organic molecule
Emp. Form.:
C16H10F2O2S
Mol. Mass.:
304.311
SMILES:
Oc1ccc(-c2csc(c2)-c2ccc(O)cc2F)c(F)c1
: