Target
Estrogen receptor beta
Ligand
BDBM50431198
Substrate
Meas. Tech.
ChEMBL_948804 (CHEMBL2339766)
EC50
1870±n/a nM
Citation
 Min, JWang, PSrinivasan, SNwachukwu, JCGuo, PHuang, MCarlson, KEKatzenellenbogen, JANettles, KWZhou, HB Thiophene-core estrogen receptor ligands having superagonist activity. J Med Chem 56:3346-66 (2013)  
Target
Name:
Estrogen receptor beta
Synonyms:
ER-beta ESR2_HUMAN Estradiol receptor beta (ERβ) Estrogen receptor (ER beta) Estrogen receptor beta (ER beta) NR3A2 estrogen beta
Type:
Protein
Mol. Mass.:
59238.43
Organism:
Homo sapiens (Human)
Description:
Q92731
Residue:
530
  
Inhibitor
Name:
BDBM50431198
Synonyms:
CHEMBL2031541
Type:
Small organic molecule
Emp. Form.:
C18H16O2S
Mol. Mass.:
296.383
SMILES:
Cc1cc(O)ccc1-c1cscc1-c1ccc(O)cc1C
: