Target
Estrogen receptor beta
Ligand
BDBM25849
Substrate
Meas. Tech.
ChEMBL_948804 (CHEMBL2339766)
EC50
1540±n/a nM
Citation
 Min, JWang, PSrinivasan, SNwachukwu, JCGuo, PHuang, MCarlson, KEKatzenellenbogen, JANettles, KWZhou, HB Thiophene-core estrogen receptor ligands having superagonist activity. J Med Chem 56:3346-66 (2013)  
Target
Name:
Estrogen receptor beta
Synonyms:
ER-beta ESR2_HUMAN Estradiol receptor beta (ERβ) Estrogen receptor (ER beta) Estrogen receptor beta (ER beta) NR3A2 estrogen beta
Type:
Protein
Mol. Mass.:
59238.43
Organism:
Homo sapiens (Human)
Description:
Q92731
Residue:
530
  
Inhibitor
Name:
BDBM25849
Synonyms:
4-[5-(4-hydroxyphenyl)thiophen-2-yl]phenol hydroxyphenyl substituted thiophene, 21
Type:
Small organic molecule
Emp. Form.:
C16H12O2S
Mol. Mass.:
268.33
SMILES:
Oc1ccc(cc1)-c1ccc(s1)-c1ccc(O)cc1
: