Target
Estrogen receptor
Ligand
BDBM50431188
Substrate
Meas. Tech.
ChEMBL_948806 (CHEMBL2339768)
EC50
485±n/a nM
Citation
 Min, JWang, PSrinivasan, SNwachukwu, JCGuo, PHuang, MCarlson, KEKatzenellenbogen, JANettles, KWZhou, HB Thiophene-core estrogen receptor ligands having superagonist activity. J Med Chem 56:3346-66 (2013)  
Target
Name:
Estrogen receptor
Synonyms:
ER ESR ESR1_HUMAN Estrogen receptor Estrogen receptor (ER-alpha) Estrogen receptor alpha (ER) Nuclear receptor subfamily 3 group A member 1
Type:
Protein
Mol. Mass.:
66230.44
Organism:
Homo sapiens (Human)
Description:
P03372
Residue:
595
  
Inhibitor
Name:
BDBM50431188
Synonyms:
2,3,5-Tris(4-Hydroxyphenyl)Thiophene | CHEMBL2332580
Type:
Small organic molecule
Emp. Form.:
C22H16O3S
Mol. Mass.:
360.426
SMILES:
Oc1ccc(cc1)-c1cc(c(s1)-c1ccc(O)cc1)-c1ccc(O)cc1
: