Target
Estrogen receptor
Ligand
BDBM50431190
Substrate
Meas. Tech.
ChEMBL_948806 (CHEMBL2339768)
EC50
447±n/a nM
Citation
 Min, JWang, PSrinivasan, SNwachukwu, JCGuo, PHuang, MCarlson, KEKatzenellenbogen, JANettles, KWZhou, HB Thiophene-core estrogen receptor ligands having superagonist activity. J Med Chem 56:3346-66 (2013)  
Target
Name:
Estrogen receptor
Synonyms:
ER ESR ESR1_HUMAN Estrogen receptor Estrogen receptor (ER-alpha) Estrogen receptor alpha (ER) Nuclear receptor subfamily 3 group A member 1
Type:
Protein
Mol. Mass.:
66230.44
Organism:
Homo sapiens (Human)
Description:
P03372
Residue:
595
  
Inhibitor
Name:
BDBM50431190
Synonyms:
CHEMBL2332576
Type:
Small organic molecule
Emp. Form.:
C17H12F2O2S
Mol. Mass.:
318.338
SMILES:
Cc1cc(sc1-c1ccc(O)cc1F)-c1ccc(O)cc1F
: