Target
Estrogen receptor
Ligand
BDBM50431193
Substrate
Meas. Tech.
ChEMBL_948806 (CHEMBL2339768)
EC50
1160±n/a nM
Citation
 Min, JWang, PSrinivasan, SNwachukwu, JCGuo, PHuang, MCarlson, KEKatzenellenbogen, JANettles, KWZhou, HB Thiophene-core estrogen receptor ligands having superagonist activity. J Med Chem 56:3346-66 (2013)  
Target
Name:
Estrogen receptor
Synonyms:
ER ESR ESR1_HUMAN Estrogen receptor Estrogen receptor (ER-alpha) Estrogen receptor alpha (ER) Nuclear receptor subfamily 3 group A member 1
Type:
Protein
Mol. Mass.:
66230.44
Organism:
Homo sapiens (Human)
Description:
P03372
Residue:
595
  
Inhibitor
Name:
BDBM50431193
Synonyms:
CHEMBL2332573
Type:
Small organic molecule
Emp. Form.:
C16H10Cl2O2S
Mol. Mass.:
337.22
SMILES:
Oc1ccc(-c2ccsc2-c2ccc(O)cc2Cl)c(Cl)c1
: