Target
Acid ceramidase
Ligand
BDBM50431258
Substrate
Meas. Tech.
ChEMBL_949261 (CHEMBL2346137)
IC50
18±n/a nM
Citation
 Pizzirani, DPagliuca, CRealini, NBranduardi, DBottegoni, GMor, MBertozzi, FScarpelli, RPiomelli, DBandiera, T Discovery of a new class of highly potent inhibitors of acid ceramidase: synthesis and structure-activity relationship (SAR). J Med Chem 56:3518-30 (2013)  
Target
Name:
Acid ceramidase
Synonyms:
AC ASAH1_RAT Acid ceramidase Acylsphingosine deacylase N-acylsphingosine amidohydrolase
Type:
Enzyme
Mol. Mass.:
44450.22
Organism:
Rattus norvegicus (Rat)
Description:
Q6P7S1
Residue:
394
  
Inhibitor
Name:
BDBM50431258
Synonyms:
CHEMBL2333050
Type:
Small organic molecule
Emp. Form.:
C13H20FN3O3
Mol. Mass.:
285.3146
SMILES:
CCCCCCNC(=O)n1cc(F)c(=O)n(CC)c1=O
: