Target
Proliferating cell nuclear antigen
Ligand
BDBM50431444
Substrate
Meas. Tech.
ChEMBL_952429 (CHEMBL2352795)
IC50
6000±n/a nM
Citation
 Actis, MInoue, AEvison, BPerry, SPunchihewa, CFujii, N Small molecule inhibitors of PCNA/PIP-box interaction suppress translesion DNA synthesis. Bioorg Med Chem 21:1972-7 (2013)  
Target
Name:
Proliferating cell nuclear antigen
Synonyms:
Cyclin PCNA_HUMAN
Type:
PROTEIN
Mol. Mass.:
28752.86
Organism:
Homo sapiens (Human)
Description:
ChEMBL_952429
Residue:
261
  
Inhibitor
Name:
BDBM50431444
Synonyms:
CHEMBL2348282
Type:
Small organic molecule
Emp. Form.:
C17H17I2NO4
Mol. Mass.:
553.1301
SMILES:
OCCNC(=O)CCc1cc(I)c(Oc2ccc(O)cc2)c(I)c1
: