Target
Proliferating cell nuclear antigen
Ligand
BDBM50431448
Substrate
Meas. Tech.
ChEMBL_952429 (CHEMBL2352795)
IC50
8600±n/a nM
Citation
 Actis, MInoue, AEvison, BPerry, SPunchihewa, CFujii, N Small molecule inhibitors of PCNA/PIP-box interaction suppress translesion DNA synthesis. Bioorg Med Chem 21:1972-7 (2013)  
Target
Name:
Proliferating cell nuclear antigen
Synonyms:
Cyclin PCNA_HUMAN
Type:
PROTEIN
Mol. Mass.:
28752.86
Organism:
Homo sapiens (Human)
Description:
ChEMBL_952429
Residue:
261
  
Inhibitor
Name:
BDBM50431448
Synonyms:
CHEMBL2348301
Type:
Small organic molecule
Emp. Form.:
C20H14I3NO5S
Mol. Mass.:
761.107
SMILES:
Oc1ccc(Oc2c(I)cc(CC(=O)NS(=O)(=O)c3ccccc3)cc2I)cc1I
: