Target
Proliferating cell nuclear antigen
Ligand
BDBM50431450
Substrate
Meas. Tech.
ChEMBL_952429 (CHEMBL2352795)
IC50
2700±n/a nM
Citation
 Actis, MInoue, AEvison, BPerry, SPunchihewa, CFujii, N Small molecule inhibitors of PCNA/PIP-box interaction suppress translesion DNA synthesis. Bioorg Med Chem 21:1972-7 (2013)  
Target
Name:
Proliferating cell nuclear antigen
Synonyms:
Cyclin PCNA_HUMAN
Type:
PROTEIN
Mol. Mass.:
28752.86
Organism:
Homo sapiens (Human)
Description:
ChEMBL_952429
Residue:
261
  
Inhibitor
Name:
BDBM50431450
Synonyms:
CHEMBL2348299
Type:
Small organic molecule
Emp. Form.:
C18H16I3NO4
Mol. Mass.:
691.0374
SMILES:
Oc1ccc(Oc2c(I)cc(CC(=O)N3CCOCC3)cc2I)cc1I
: