Target
Proliferating cell nuclear antigen
Ligand
BDBM18862
Substrate
Meas. Tech.
ChEMBL_952429 (CHEMBL2352795)
IC50
25000±n/a nM
Citation
 Actis, MInoue, AEvison, BPerry, SPunchihewa, CFujii, N Small molecule inhibitors of PCNA/PIP-box interaction suppress translesion DNA synthesis. Bioorg Med Chem 21:1972-7 (2013)  
Target
Name:
Proliferating cell nuclear antigen
Synonyms:
Cyclin PCNA_HUMAN
Type:
PROTEIN
Mol. Mass.:
28752.86
Organism:
Homo sapiens (Human)
Description:
ChEMBL_952429
Residue:
261
  
Inhibitor
Name:
BDBM18862
Synonyms:
2-[4-(4-hydroxy-3-iodophenoxy)-3,5-diiodophenyl]acetic acid TRIAC Triiodothyroacetic acid, 3 | US10322118, Entry Tiratricol
Type:
Small organic molecule
Emp. Form.:
C14H9I3O4
Mol. Mass.:
621.9323
SMILES:
OC(=O)Cc1cc(I)c(Oc2ccc(O)c(I)c2)c(I)c1
: