Target
Proliferating cell nuclear antigen
Ligand
BDBM50431458
Substrate
Meas. Tech.
ChEMBL_952429 (CHEMBL2352795)
IC50
1000±n/a nM
Citation
 Actis, MInoue, AEvison, BPerry, SPunchihewa, CFujii, N Small molecule inhibitors of PCNA/PIP-box interaction suppress translesion DNA synthesis. Bioorg Med Chem 21:1972-7 (2013)  
Target
Name:
Proliferating cell nuclear antigen
Synonyms:
Cyclin PCNA_HUMAN
Type:
PROTEIN
Mol. Mass.:
28752.86
Organism:
Homo sapiens (Human)
Description:
ChEMBL_952429
Residue:
261
  
Inhibitor
Name:
BDBM50431458
Synonyms:
CHEMBL2348291
Type:
Small organic molecule
Emp. Form.:
C16H18I2N2O4S
Mol. Mass.:
588.199
SMILES:
CS(=O)(=O)NC[C@@H](N)Cc1cc(I)c(Oc2ccc(O)cc2)c(I)c1
: