Target
Proliferating cell nuclear antigen
Ligand
BDBM50431460
Substrate
Meas. Tech.
ChEMBL_952429 (CHEMBL2352795)
IC50
1400±n/a nM
Citation
 Actis, MInoue, AEvison, BPerry, SPunchihewa, CFujii, N Small molecule inhibitors of PCNA/PIP-box interaction suppress translesion DNA synthesis. Bioorg Med Chem 21:1972-7 (2013)  
Target
Name:
Proliferating cell nuclear antigen
Synonyms:
Cyclin PCNA_HUMAN
Type:
PROTEIN
Mol. Mass.:
28752.86
Organism:
Homo sapiens (Human)
Description:
ChEMBL_952429
Residue:
261
  
Inhibitor
Name:
BDBM50431460
Synonyms:
CHEMBL2348289
Type:
Small organic molecule
Emp. Form.:
C20H23I2N3O4
Mol. Mass.:
623.2233
SMILES:
N[C@H](CNC(=O)N1CCOCC1)Cc1cc(I)c(Oc2ccc(O)cc2)c(I)c1
: