Target
Proliferating cell nuclear antigen
Ligand
BDBM50431461
Substrate
Meas. Tech.
ChEMBL_952429 (CHEMBL2352795)
IC50
1300±n/a nM
Citation
 Actis, MInoue, AEvison, BPerry, SPunchihewa, CFujii, N Small molecule inhibitors of PCNA/PIP-box interaction suppress translesion DNA synthesis. Bioorg Med Chem 21:1972-7 (2013)  
Target
Name:
Proliferating cell nuclear antigen
Synonyms:
Cyclin PCNA_HUMAN
Type:
PROTEIN
Mol. Mass.:
28752.86
Organism:
Homo sapiens (Human)
Description:
ChEMBL_952429
Residue:
261
  
Inhibitor
Name:
BDBM50431461
Synonyms:
CHEMBL2348288
Type:
Small organic molecule
Emp. Form.:
C19H23I2N3O3
Mol. Mass.:
595.2132
SMILES:
CC(C)NC(=O)NC[C@@H](N)Cc1cc(I)c(Oc2ccc(O)cc2)c(I)c1
: