Target
Proliferating cell nuclear antigen
Ligand
BDBM50431463
Substrate
Meas. Tech.
ChEMBL_952429 (CHEMBL2352795)
IC50
6000±n/a nM
Citation
 Actis, MInoue, AEvison, BPerry, SPunchihewa, CFujii, N Small molecule inhibitors of PCNA/PIP-box interaction suppress translesion DNA synthesis. Bioorg Med Chem 21:1972-7 (2013)  
Target
Name:
Proliferating cell nuclear antigen
Synonyms:
Cyclin PCNA_HUMAN
Type:
PROTEIN
Mol. Mass.:
28752.86
Organism:
Homo sapiens (Human)
Description:
ChEMBL_952429
Residue:
261
  
Inhibitor
Name:
BDBM50431463
Synonyms:
CHEMBL2348286
Type:
Small organic molecule
Emp. Form.:
C16H17I2NO5S
Mol. Mass.:
589.184
SMILES:
CS(=O)(=O)N[C@H](CO)Cc1cc(I)c(Oc2ccc(O)cc2)c(I)c1
: