Target
Beta-secretase 1
Ligand
BDBM50432171
Substrate
Meas. Tech.
ChEMBL_950631 (CHEMBL2352381)
IC50
590±n/a nM
Citation
 Bowers, SXu, YZYuan, SProbst, GDHom, RKChan, WKonradi, AWSham, HLZhu, YLBeroza, PPan, HBrecht, EYao, NLougheed, JTam, DRen, ZRuslim, LBova, MPArtis, DR Structure-based design of novel dihydroisoquinoline BACE-1 inhibitors that do not engage the catalytic aspartates. Bioorg Med Chem Lett 23:2181-6 (2013)  
Target
Name:
Beta-secretase 1
Synonyms:
ASP2 Aspartyl protease 2 BACE1 Beta-secretase (BACE) Beta-secretase 1 (BACE 1) Beta-secretase 1 (BACE1) Beta-site amyloid precursor protein cleaving enzyme 1 Memapsin-2 beta-Secretase (BACE-1) | beta-Secretase (BACE1)
Type:
Protein
Mol. Mass.:
55755.10
Organism:
Homo sapiens (Human)
Description:
P56817
Residue:
501
  
Inhibitor
Name:
BDBM50432171
Synonyms:
CHEMBL2346804
Type:
Small organic molecule
Emp. Form.:
C23H22ClIN4O
Mol. Mass.:
532.804
SMILES:
CC1(C)Cc2cc(Cl)ccc2C(N[C@@H](Cc2ccccc2)c2ncc(I)c(=O)[nH]2)=N1
: