Target
Neuromedin-K receptor
Ligand
BDBM50432255
Substrate
Meas. Tech.
ChEMBL_950964 (CHEMBL2350290)
EC50
3.4±n/a nM
Citation
 Misu, RNoguchi, TOhno, HOishi, SFujii, N Structure-activity relationship study of tachykinin peptides for the development of novel neurokinin-3 receptor selective agonists. Bioorg Med Chem 21:2413-7 (2013)  
Target
Name:
Neuromedin-K receptor
Synonyms:
NK-3 receptor NK3R NKR Neurokinin B receptor Neuromedin-3 receptor (NK-3R) Neuromedin-K receptor Neuromedin-K receptor (NK3) TAC3R Tachykinin receptor 3 | Tachykinin receptor 3 (NK3)
Type:
Enzyme
Mol. Mass.:
52221.96
Organism:
Homo sapiens (Human)
Description:
P29371
Residue:
465
  
Inhibitor
Name:
BDBM50432255
Synonyms:
PHYSALAEMIN
Type:
Small organic molecule
Emp. Form.:
C57H82N14O16S
Mol. Mass.:
1251.41
SMILES:
CSCCC(NC(=O)C(CC(C)C)NC(=O)CNC(=O)C(NC(=O)C(Cc1ccccc1)NC(=O)C(CCCCN)NC(=O)C(CC(N)=O)NC(=O)C1CCCN1C(=O)C(CC(O)=O)NC(=O)C(C)NC(=O)[C@@H]1CCC(=O)N1)c1ccc(O)cc1)C(N)=O
: