Target
Aurora kinase A
Ligand
BDBM50433653
Substrate
Meas. Tech.
ChEMBL_959028 (CHEMBL2382841)
IC50
9.0±n/a nM
Citation
 Karra, SXiao, YChen, XLiu-Bujalski, LHuck, BSutton, AGoutopoulos, AAskew, BJosephson, KJiang, XShutes, AShankar, VNoonan, TGarcia-Berrios, GDong, RDhanabal, MTian, HWang, ZClark, AGoodstal, S SAR and evaluation of novel 5H-benzo[c][1,8]naphthyridin-6-one analogs as Aurora kinase inhibitors. Bioorg Med Chem Lett 23:3081-7 (2013)  
Target
Name:
Aurora kinase A
Synonyms:
AIK ARK-1 AURA AURKA_HUMAN Aurora 2 Aurora kinase A (AURKA) Aurora kinase A (Aurora-2) Aurora/IPL1-related kinase 1 Breast tumor-amplified kinase IAK1 STK15 GN Serine/threonine kinase 15 Serine/threonine-protein kinase 6 Serine/threonine-protein kinase aurora-A aurora-2 | hARK1
Type:
Serine/threonine-protein kinase
Mol. Mass.:
45830.98
Organism:
Homo sapiens (Human)
Description:
O14965
Residue:
403
  
Inhibitor
Name:
BDBM50433653
Synonyms:
CHEMBL2380837
Type:
Small organic molecule
Emp. Form.:
C26H16F4N4O2
Mol. Mass.:
492.4245
SMILES:
Fc1cc(cc(c1)C(F)(F)F)C(=O)Nc1ccc(Nc2ccnc3[nH]c(=O)c4ccccc4c23)cc1
: