Target
Histone deacetylase 3
Ligand
BDBM50434126
Substrate
Meas. Tech.
ChEMBL_958898 (CHEMBL2384806)
IC50
23000±n/a nM
Citation
 Olson, DEWagner, FFKaya, TGale, JPAidoud, NDavoine, ELLazzaro, FWeïwer, MZhang, YLHolson, EB Discovery of the first histone deacetylase 6/8 dual inhibitors. J Med Chem 56:4816-20 (2013)  
Target
Name:
Histone deacetylase 3
Synonyms:
HD3 HDAC3_HUMAN Human HDAC3 SMAP45
Type:
Enzyme
Mol. Mass.:
48829.55
Organism:
Homo sapiens (Human)
Description:
O15379
Residue:
428
  
Inhibitor
Name:
BDBM50434126
Synonyms:
CHEMBL2381517
Type:
Small organic molecule
Emp. Form.:
C16H16N2O3
Mol. Mass.:
284.3098
SMILES:
ONC(=O)c1cccc(c1)C(=O)NCCc1ccccc1
: