Target
Macrophage metalloelastase
Ligand
BDBM50434221
Substrate
Meas. Tech.
ChEMBL_960929 (CHEMBL2388547)
Ki
6.0±n/a nM
Citation
 Mori, MMassaro, ACalderone, VFragai, MLuchinat, CMordini, A Discovery of a New Class of Potent MMP Inhibitors by Structure-Based Optimization of the Arylsulfonamide Scaffold. ACS Med Chem Lett 4:565-9 (2013)  
Target
Name:
Macrophage metalloelastase
Synonyms:
HME MMP12_HUMAN Matrix metalloproteinase-12 (MMP 12) Matrix metalloproteinase-12 (MMP12) | Matrix metalloproteinases 12 (MMP-12)
Type:
Enzyme
Mol. Mass.:
54012.99
Organism:
Homo sapiens (Human)
Description:
P39900
Residue:
470
  
Inhibitor
Name:
BDBM50434221
Synonyms:
CHEMBL2385490
Type:
Small organic molecule
Emp. Form.:
C8H11ClN2O4S2
Mol. Mass.:
298.767
SMILES:
ONC(=O)CNS(=O)(=O)CCc1ccc(Cl)s1
: