Target
Macrophage metalloelastase
Ligand
BDBM50294120
Substrate
Meas. Tech.
ChEMBL_960929 (CHEMBL2388547)
Ki
2.0±n/a nM
Citation
 Mori, MMassaro, ACalderone, VFragai, MLuchinat, CMordini, A Discovery of a New Class of Potent MMP Inhibitors by Structure-Based Optimization of the Arylsulfonamide Scaffold. ACS Med Chem Lett 4:565-9 (2013)  
Target
Name:
Macrophage metalloelastase
Synonyms:
HME MMP12_HUMAN Matrix metalloproteinase-12 (MMP 12) Matrix metalloproteinase-12 (MMP12) | Matrix metalloproteinases 12 (MMP-12)
Type:
Enzyme
Mol. Mass.:
54012.99
Organism:
Homo sapiens (Human)
Description:
P39900
Residue:
470
  
Inhibitor
Name:
BDBM50294120
Synonyms:
2-(biphenyl-4-ylsulfonamido)-N-hydroxyacetamide | CHEMBL550148
Type:
Small organic molecule
Emp. Form.:
C14H14N2O4S
Mol. Mass.:
306.337
SMILES:
ONC(=O)CNS(=O)(=O)c1ccc(cc1)-c1ccccc1
: