Target
Free fatty acid receptor 1
Ligand
BDBM50425662
Substrate
Meas. Tech.
ChEMBL_961971 (CHEMBL2390712)
EC50
69±n/a nM
Citation
 Christiansen, EHansen, SVUrban, CHudson, BDWargent, ETGrundmann, MJenkins, LZaibi, MStocker, CJUllrich, SKostenis, EKassack, MUMilligan, GCawthorne, MAUlven, T Discovery of TUG-770: A Highly Potent Free Fatty Acid Receptor 1 (FFA1/GPR40) Agonist for Treatment of Type 2 Diabetes. ACS Med Chem Lett 4:441-445 (2013)  
Target
Name:
Free fatty acid receptor 1
Synonyms:
FFAR1 G-protein Coupled Receptor 40 | GPR40
Type:
G Protein-Coupled Receptor (GPCR)
Mol. Mass.:
31473.32
Organism:
Homo sapiens (Human)
Description:
O14842
Residue:
300
  
Inhibitor
Name:
BDBM50425662
Synonyms:
CHEMBL2315528
Type:
Small organic molecule
Emp. Form.:
C19H15NO2
Mol. Mass.:
289.3279
SMILES:
OC(=O)CCc1ccc(cc1)C#Cc1ccccc1CC#N
: