Target
Urea transporter 1
Ligand
BDBM50394962
Substrate
Meas. Tech.
ChEMBL_964780 (CHEMBL2394864)
IC50
11±n/a nM
Citation
 Liu, YEsteva-Font, CYao, CPhuan, PWVerkman, ASAnderson, MO 1,1-Difluoroethyl-substituted triazolothienopyrimidines as inhibitors of a human urea transport protein (UT-B): new analogs and binding model. Bioorg Med Chem Lett 23:3338-41 (2013)  
Target
Name:
Urea transporter 1
Synonyms:
Slc14a1 UT-B Urea transporter B | Urea transporter, erythrocyte
Type:
PROTEIN
Mol. Mass.:
42130.98
Organism:
Mus musculus
Description:
ChEMBL_964780
Residue:
384
  
Inhibitor
Name:
BDBM50394962
Synonyms:
CHEMBL1394231
Type:
Small organic molecule
Emp. Form.:
C20H17N5O2S3
Mol. Mass.:
455.576
SMILES:
CCc1ccc(cc1)S(=O)(=O)c1nnn2c3ccsc3c(NCc3cccs3)nc12
: